python – Error packaging Kivy with numpy library for Android using buildozer-ThrowExceptions

Exception or error:

I am trying to create an Android package of my Kivy application using buildozer but I am getting this error when I try to include the numpy:

resume of the error:

compile options: '-DNO_ATLAS_INFO=1 -Inumpy/core/include -Ibuild/src.linux-x86_64-2.7/numpy/core/include/numpy -Inumpy/core/src/private -Inumpy/core/src -Inumpy/core -Inumpy/core/src/npymath -Inumpy/core/src/multiarray -Inumpy/core/src/umath -Inumpy/core/src/npysort -Inumpy/core/include -I/home/joao/github/buildozer/.buildozer/android/platform/python-for-android/build/python-install/include/python2.7 -Ibuild/src.linux-x86_64-2.7/numpy/core/src/multiarray -Ibuild/src.linux-x86_64-2.7/numpy/core/src/umath -c'
ccache: numpy/linalg/lapack_litemodule.c
ccache: numpy/linalg/python_xerbla.c
/usr/bin/gfortran -Wall -lm build/temp.linux-x86_64-2.7/numpy/linalg/lapack_litemodule.o build/temp.linux-x86_64-2.7/numpy/linalg/python_xerbla.o -L/usr/lib -L/home/joao/github/buildozer/.buildozer/android/platform/python-for-android/build/python-install/lib -Lbuild/temp.linux-x86_64-2.7 -llapack -lblas -lpython2.7 -lgfortran -o build/lib.linux-x86_64-2.7/numpy/linalg/lapack_lite.so
/usr/bin/ld: build/temp.linux-x86_64-2.7/numpy/linalg/lapack_litemodule.o: Relocations in generic ELF (EM: 40)
/usr/bin/ld: build/temp.linux-x86_64-2.7/numpy/linalg/lapack_litemodule.o: Relocations in generic ELF (EM: 40)
build/temp.linux-x86_64-2.7/numpy/linalg/lapack_litemodule.o: error adding symbols: File in wrong format
collect2: error: ld returned 1 exit status
/usr/bin/ld: build/temp.linux-x86_64-2.7/numpy/linalg/lapack_litemodule.o: Relocations in generic ELF (EM: 40)
/usr/bin/ld: build/temp.linux-x86_64-2.7/numpy/linalg/lapack_litemodule.o: Relocations in generic ELF (EM: 40)
build/temp.linux-x86_64-2.7/numpy/linalg/lapack_litemodule.o: error adding symbols: File in wrong format
collect2: error: ld returned 1 exit status
unable to execute _configtest: Exec format error
error: Command "/usr/bin/gfortran -Wall -lm build/temp.linux-x86_64-2.7/numpy/linalg/lapack_litemodule.o build/temp.linux-x86_64-2.7/numpy/linalg/python_xerbla.o -L/usr/lib -L/home/joao/github/buildozer/.buildozer/android/platform/python-for-android/build/python-install/lib -Lbuild/temp.linux-x86_64-2.7 -llapack -lblas -lpython2.7 -lgfortran -o build/lib.linux-x86_64-2.7/numpy/linalg/lapack_lite.so" failed with exit status 1

does anyone knows how to solve it?

P.S. I am using Ubuntu 14.04 64-bit

How to solve:

Try sudo apt-get install libatlas-base-dev it looks like you’re missing some libraries

Leave a Reply

Your email address will not be published. Required fields are marked *